Target
D(3) dopamine receptor
Ligand
BDBM50132029
Substrate
Meas. Tech.
ChEMBL_62137 (CHEMBL675894)
Ki
6.3±n/a nM
Citation
 Hackling, AGhosh, RPerachon, SMann, AHöltje, HDWermuth, CGSchwartz, JCSippl, WSokoloff, PStark, H N-(omega-(4-(2-methoxyphenyl)piperazin-1-yl)alkyl)carboxamides as dopamine D2 and D3 receptor ligands. J Med Chem 46:3883-99 (2003)  
Target
Name:
D(3) dopamine receptor
Synonyms:
DOPAMINE D3 DRD3_HUMAN Dopamine D3 receptor (D3) Dopamine receptor Dopamine receptor D3
Type:
Mol. Mass.:
44243.43
Organism:
Homo sapiens (Human)
Description:
Residue:
400
  
Inhibitor
Name:
BDBM50132029
Synonyms:
5-(4-Chloro-phenyl)-furan-2-carboxylic acid {4-[4-(2-methoxy-phenyl)-piperazin-1-yl]-butyl}-amide; oxalic acid | CHEMBL127029
Type:
Small organic molecule
Emp. Form.:
C26H30ClN3O3
Mol. Mass.:
467.988
SMILES:
COc1ccccc1N1CCN(CCCCNC(=O)c2ccc(o2)-c2ccc(Cl)cc2)CC1
: