Target
D(3) dopamine receptor
Ligand
BDBM50007179
Substrate
Meas. Tech.
ChEMBL_62137 (CHEMBL675894)
Ki
3.9±n/a nM
Citation
 Hackling, AGhosh, RPerachon, SMann, AHöltje, HDWermuth, CGSchwartz, JCSippl, WSokoloff, PStark, H N-(omega-(4-(2-methoxyphenyl)piperazin-1-yl)alkyl)carboxamides as dopamine D2 and D3 receptor ligands. J Med Chem 46:3883-99 (2003)  
Target
Name:
D(3) dopamine receptor
Synonyms:
DOPAMINE D3 DRD3_HUMAN Dopamine D3 receptor (D3) Dopamine receptor Dopamine receptor D3
Type:
Mol. Mass.:
44243.43
Organism:
Homo sapiens (Human)
Description:
Residue:
400
  
Inhibitor
Name:
BDBM50007179
Synonyms:
4-Iodo-N-{4-[4-(2-methoxy-phenyl)-piperazin-1-yl]-butyl}-benzamide | CHEMBL27254
Type:
Small organic molecule
Emp. Form.:
C22H28IN3O2
Mol. Mass.:
493.3811
SMILES:
COc1ccccc1N1CCN(CCCCNC(=O)c2ccc(I)cc2)CC1
: