Target
Dual specificity mitogen-activated protein kinase kinase 1
Ligand
BDBM50132261
Substrate
Meas. Tech.
ChEBML_124004
IC50
2±n/a nM
Citation
 Berger, DDutia, MPowell, DWu, BWissner, ABoschelli, DHFloyd, MBZhang, NTorres, NLevin, JDu, XWojciechowicz, DDiscafani, CKohler, CKim, SCFeldberg, LRCollins, KMallon, R Synthesis and evaluation of 4-anilino-6,7-dialkoxy-3-quinolinecarbonitriles as inhibitors of kinases of the Ras-MAPK signaling cascade. Bioorg Med Chem Lett 13:3031-4 (2003)  
Target
Name:
Dual specificity mitogen-activated protein kinase kinase 1
Synonyms:
Dual specificity mitogen-activated protein kinase (MEK) Dual specificity mitogen-activated protein kinase kinase 1 (MEK1) Dual specificity mitogen-activated protein kinase kinase MEK1/2 MAP kinase kinase 1 MAPK/ERK kinase 1 MEK-1 MP2K1_HUMAN PRKMK1 | VHL-MAP2K1/MAP2K2
Type:
Other Protein Type
Mol. Mass.:
43439.03
Organism:
Homo sapiens (Human)
Description:
Full-length human MEK-1 was generated by PCR and purified as a fusion protein from Escherichia coli lysates.
Residue:
393
  
Inhibitor
Name:
BDBM50132261
Synonyms:
4-[3-Chloro-4-(1-methyl-1H-imidazol-2-ylsulfanyl)-phenylamino]-6-methoxy-7-[3-(1-oxo-1lambda*4*-thiomorpholin-4-yl)-propoxy]-quinoline-3-carbonitrile | CHEMBL105642
Type:
Small organic molecule
Emp. Form.:
C28H29ClN6O3S2
Mol. Mass.:
597.151
SMILES:
COc1cc2c(Nc3ccc(Sc4nccn4C)c(Cl)c3)c(cnc2cc1OCCCN1CCS(=O)CC1)C#N
: