Target
Cannabinoid receptor 1
Ligand
BDBM50160436
Substrate
Meas. Tech.
ChEMBL_302577 (CHEMBL839538)
Ki
1758±n/a nM
Citation
 Lavey, BJKozlowski, JAHipkin, RWGonsiorek, WLundell, DJPiwinski, JJNarula, SLunn, CA Triaryl bis-sulfones as a new class of cannabinoid CB2 receptor inhibitors: identification of a lead and initial SAR studies. Bioorg Med Chem Lett 15:783-6 (2005)  
Target
Name:
Cannabinoid receptor 1
Synonyms:
CANN6 CB-R CNR CNR1_HUMAN Cannabinoid receptor Cannabinoid receptor 1 (brain)
Type:
G Protein-Coupled Receptor (GPCR)
Mol. Mass.:
52868.96
Organism:
Homo sapiens (Human)
Description:
P21554
Residue:
472
  
Inhibitor
Name:
BDBM50160436
Synonyms:
1-(4-Fluoro-phenyl)-3-((S)-1-{4-[4-methoxy-2-(4-methoxy-benzenesulfonyl)-benzenesulfonyl]-phenyl}-ethyl)-urea | CHEMBL179888
Type:
Small organic molecule
Emp. Form.:
C29H27FN2O7S2
Mol. Mass.:
598.662
SMILES:
COc1ccc(cc1)S(=O)(=O)c1cc(OC)ccc1S(=O)(=O)c1ccc(cc1)[C@H](C)NC(=O)Nc1ccc(F)cc1
: