Target
E3 ubiquitin-protein ligase Mdm2
Ligand
BDBM31285
Substrate
Meas. Tech.
ChEMBL_306060 (CHEMBL874553)
IC50
200±n/a nM
Citation
 Raboisson, PMarugán, JJSchubert, CKoblish, HKLu, TZhao, SPlayer, MRMaroney, ACReed, RLHuebert, NDLattanze, JParks, DJCummings, MD Structure-based design, synthesis, and biological evaluation of novel 1,4-diazepines as HDM2 antagonists. Bioorg Med Chem Lett 15:1857-61 (2005)  
Target
Name:
E3 ubiquitin-protein ligase Mdm2
Synonyms:
Double minute 2 protein E3 ubiquitin-protein ligase Mdm2 (p53-binding protein Mdm2) Human Double Minute 2 (HDM2) MDM2-MDMX p53-Binding Protein MDM2 | p53-binding protein
Type:
Oncoprotein
Mol. Mass.:
55196.54
Organism:
Homo sapiens (Human)
Description:
Q00987
Residue:
491
  
Inhibitor
Name:
BDBM31285
Synonyms:
BMCL163310 Compound 1 benzodiazepinedione, 1
Type:
Small organic molecule
Emp. Form.:
C23H15Cl2IN2O4
Mol. Mass.:
581.187
SMILES:
OC(=O)[C@@H](N1[C@@H](c2ccc(Cl)cc2)C(=O)Nc2ccc(I)cc2C1=O)c1ccc(Cl)cc1
: