Target
Growth hormone secretagogue receptor type 1
Ligand
BDBM50181204
Substrate
Meas. Tech.
ChEMBL_345663 (CHEMBL859713)
IC50
14±n/a nM
Citation
 Liu, BLiu, MXin, ZZhao, HSerby, MDKosogof, CNelson, LTSzczepankiewicz, BGKaszubska, WSchaefer, VGFalls, HDLin, CWCollins, CASham, HLLiu, G Optimization of 2,4-diaminopyrimidines as GHS-R antagonists: side chain exploration. Bioorg Med Chem Lett 16:1864-8 (2006)  
Target
Name:
Growth hormone secretagogue receptor type 1
Synonyms:
GH-releasing peptide receptor GHS-R GHSR_HUMAN Ghrelin receptor | Ghrelin receptor 1a (GHS-R1a)
Type:
Receptor
Mol. Mass.:
41334.57
Organism:
Homo sapiens (Human)
Description:
Receptor binding studies use plasma membranes from LLC PK-1 cells transiently transfected with hGHSR1a.
Residue:
366
  
Inhibitor
Name:
BDBM50181204
Synonyms:
5-(4-(4-(methylsulfonyl)benzylamino)phenyl)-6-isopropylpyrimidine-2,4-diamine | CHEMBL205374
Type:
Small organic molecule
Emp. Form.:
C21H25N5O2S
Mol. Mass.:
411.521
SMILES:
CC(C)c1nc(N)nc(N)c1-c1ccc(NCc2ccc(cc2)S(C)(=O)=O)cc1
: