Target
Growth hormone secretagogue receptor type 1
Ligand
BDBM50181212
Substrate
Meas. Tech.
ChEMBL_345663 (CHEMBL859713)
IC50
180±n/a nM
Citation
 Liu, BLiu, MXin, ZZhao, HSerby, MDKosogof, CNelson, LTSzczepankiewicz, BGKaszubska, WSchaefer, VGFalls, HDLin, CWCollins, CASham, HLLiu, G Optimization of 2,4-diaminopyrimidines as GHS-R antagonists: side chain exploration. Bioorg Med Chem Lett 16:1864-8 (2006)  
Target
Name:
Growth hormone secretagogue receptor type 1
Synonyms:
GH-releasing peptide receptor GHS-R GHSR_HUMAN Ghrelin receptor | Ghrelin receptor 1a (GHS-R1a)
Type:
Receptor
Mol. Mass.:
41334.57
Organism:
Homo sapiens (Human)
Description:
Receptor binding studies use plasma membranes from LLC PK-1 cells transiently transfected with hGHSR1a.
Residue:
366
  
Inhibitor
Name:
BDBM50181212
Synonyms:
5-(4-(4-(methylsulfonyl)benzylamino)phenyl)-6-(2,3-dihydrobenzo[b][1,4]dioxin-2-yl)pyrimidine-2,4-diamine | CHEMBL204776
Type:
Small organic molecule
Emp. Form.:
C26H25N5O4S
Mol. Mass.:
503.573
SMILES:
CS(=O)(=O)c1ccc(CNc2ccc(cc2)-c2c(N)nc(N)nc2C2COc3ccccc3O2)cc1
: