Target
Amine oxidase [flavin-containing] A
Ligand
BDBM50181849
Substrate
Meas. Tech.
ChEMBL_332420 (CHEMBL865201)
IC50
43020±n/a nM
Citation
 Santana, LUriarte, EGonzález-Díaz, HZagotto, GSoto-Otero, RMéndez-Alvarez, E A QSAR model for in silico screening of MAO-A inhibitors. Prediction, synthesis, and biological assay of novel coumarins. J Med Chem 49:1149-56 (2006)  
Target
Name:
Amine oxidase [flavin-containing] A
Synonyms:
AOFA_HUMAN MAO-A Monoamine oxidase Monoamine oxidase type A (MAO A) Monoamine oxidase type A (MAOA)
Type:
Protein
Mol. Mass.:
59689.53
Organism:
Homo sapiens (Human)
Description:
P21397
Residue:
527
  
Inhibitor
Name:
BDBM50181849
Synonyms:
4-methyl-7-(2-oxocyclohexyloxy)-2H-chromen-2-one | CHEMBL202018
Type:
Small organic molecule
Emp. Form.:
C16H16O4
Mol. Mass.:
272.2958
SMILES:
Cc1cc(=O)oc2cc(OC3CCCCC3=O)ccc12
: