Target
Proto-oncogene tyrosine-protein kinase Src
Ligand
BDBM50142885
Substrate
Meas. Tech.
ChEMBL_336777 (CHEMBL864338)
Ki
3700±n/a nM
Citation
 Carraro, FNaldini, APucci, ALocatelli, GAMaga, GSchenone, SBruno, ORanise, ABondavalli, FBrullo, CFossa, PMenozzi, GMosti, LModugno, MTintori, CManetti, FBotta, M Pyrazolo[3,4-d]pyrimidines as potent antiproliferative and proapoptotic agents toward A431 and 8701-BC cells in culture via inhibition of c-Src phosphorylation. J Med Chem 49:1549-61 (2006)  
Target
Name:
Proto-oncogene tyrosine-protein kinase Src
Synonyms:
Calmodulin/Proto-oncogene tyrosine-protein kinase Src Proto-oncogene c-Src SRC SRC_HUMAN V-src sarcoma (Schmidt-Ruppin A-2) viral oncogene homolog (avian) p60-Src | pp60c-src
Type:
Protein
Mol. Mass.:
59838.60
Organism:
Homo sapiens (Human)
Description:
P12931
Residue:
536
  
Inhibitor
Name:
BDBM50142885
Synonyms:
Benzyl-[1-(2-chloro-2-phenyl-ethyl)-6-methylsulfanyl-1H-pyrazolo[3,4-d]pyrimidin-4-yl]-amine N-benzyl-1-(2-chloro-2-phenylethyl)-6-(methylthio)-1H-pyrazolo[3,4-d]pyrimidin-4-amine
Type:
Small organic molecule
Emp. Form.:
C21H20ClN5S
Mol. Mass.:
409.935
SMILES:
CSc1nc(NCc2ccccc2)c2cnn(CC(Cl)c3ccccc3)c2n1
: