Target
Sodium-dependent serotonin transporter
Ligand
BDBM22416
Substrate
Meas. Tech.
ChEMBL_509625 (CHEMBL1001386)
Ki
0.38±n/a nM
Citation
 Funke, UFischer, SHiller, AScheunemann, MDeuther-Conrad, WBrust, PSteinbach, J 3-(4-(6-Fluoroalkoxy-3,4-dihydroisoquinoline-2(1H)-yl)cyclohexyl)-1H-indole-5-carbonitriles for SERT imaging: chemical synthesis, evaluation in vitro and radiofluorination. Bioorg Med Chem Lett 18:4727-30 (2008)  
Target
Name:
Sodium-dependent serotonin transporter
Synonyms:
5-HT Transporter 5HTT SC6A4_HUMAN SLC6A4 Serotonin transporter (5HTT) Sodium-dependent serotonin transporter (SERT) | Solute carrier family 6 member 4
Type:
Multi-pass membrane protein
Mol. Mass.:
70322.51
Organism:
Homo sapiens (Human)
Description:
P31645
Residue:
630
  
Inhibitor
Name:
BDBM22416
Synonyms:
(3S,4R)-3-[(1,3-benzodioxol-5-yloxy)methyl]-4-(4-fluorophenyl)piperidine CHEMBL490 US09969700, Paroxetine [3H]Paroxetine
Type:
radiolabeled ligand
Emp. Form.:
C19H20FNO3
Mol. Mass.:
329.3654
SMILES:
Fc1ccc(cc1)[C@@H]1CCNC[C@H]1COc1ccc2OCOc2c1
: