Target
Alpha-1A/Alpha-1B/Alpha-1D adrenergic receptor
Ligand
BDBM50280821
Substrate
Meas. Tech.
ChEMBL_33416 (CHEMBL648812)
IC50
>100±n/a nM
Citation
 Mignani, SDamour, DDoble, ALabaudinière, RMalleron, JLPiot, OGueremy, C New indole derivatives as potent and selective serotonin uptake inhibitors Bioorg Med Chem Lett 3:1913-1918 (1993)    Article 
Target
Name:
Alpha-1A/Alpha-1B/Alpha-1D adrenergic receptor
Synonyms:
Alpha-1 adrenergic receptor
Type:
Mol. Mass.:
Description:
ASSAY_ID of ChEMBL is 33416
Components:
This complex has 3 components.
Component 1
Name:
Alpha-1D adrenergic receptor
Synonyms:
ADA1D_MOUSE Adra1d Gpcr8 | adrenergic Alpha2
Type:
Enzyme
Mol. Mass.:
59890.14
Organism:
Mus musculus (Mouse)
Description:
P97714
Residue:
562
  
Component 2
Name:
Alpha-1B adrenergic receptor
Synonyms:
ADA1B_MOUSE Alpha-1 adrenergic receptor
Type:
Enzyme
Mol. Mass.:
56439.49
Organism:
Mus musculus (Mouse)
Description:
P97717
Residue:
514
  
Component 3
Name:
Alpha-1A adrenergic receptor
Synonyms:
ADA1A_MOUSE Adra1c | Alpha-1 adrenergic receptor
Type:
Enzyme
Mol. Mass.:
51769.32
Organism:
Mus musculus (Mouse)
Description:
P97718
Residue:
466
  
Inhibitor
Name:
BDBM50280821
Synonyms:
2-{2-[4-(5-Fluoro-1H-indol-3-ylmethyl)-piperidin-1-yl]-ethyl}-4,4-dimethyl-3,4-dihydro-2H-benzo[1,2,4]thiazasiline 1,1-dioxide | CHEMBL57514
Type:
Small organic molecule
Emp. Form.:
C25H32FN3O2SSi
Mol. Mass.:
485.689
SMILES:
C[Si]1(C)CN(CCN2CCC(Cc3c[nH]c4ccc(F)cc34)CC2)S(=O)(=O)c2ccccc12
: