Target
Acyl-CoA:cholesterol acyltransferase
Ligand
BDBM50051884
Substrate
Meas. Tech.
ChEMBL_28177 (CHEMBL638583)
IC50
122±n/a nM
Citation
 Smith, CAshton, MJBush, RCFacchini, VHarris, NVHart, TWJordan, RMacKenzie, RRiddell, D RP 73163: A bioavailable alkylsulphinyl-diphenylimidazole ACAT inhibitor Bioorg Med Chem Lett 6:47-50 (1996)    Article 
Target
Name:
Acyl-CoA:cholesterol acyltransferase
Synonyms:
ACAT
Type:
Mol. Mass.:
35405.31
Organism:
Oryctolagus cuniculus
Description:
Residue:
305
  
Inhibitor
Name:
BDBM50051884
Synonyms:
1-[5-(4,5-Diphenyl-1H-imidazole-2-sulfinyl)-pentyl]-3,5-dimethyl-1H-pyrazole Diphenylimidazole analogue
Type:
Small organic molecule
Emp. Form.:
C25H28N4OS
Mol. Mass.:
432.581
SMILES:
Cc1cc(C)n(CCCCCS(=O)c2nc(c([nH]2)-c2ccccc2)-c2ccccc2)n1
: