Target
Gastrin/cholecystokinin type B receptor
Ligand
BDBM50006842
Substrate
Meas. Tech.
ChEBML_48409
IC50
9.3±n/a nM
Citation
 Padia, JKChilvers, HDaum, PPinnock, RSuman-Chauhan, Nwebdale, LTrivedi, BK Design and synthesis of novel nonpeptide CCK-B receptor antagonists Bioorg Med Chem Lett 7:805-810 (1997)    Article 
Target
Name:
Gastrin/cholecystokinin type B receptor
Synonyms:
Cckbr Cholecystokinin receptor Gastrin/cholecystokinin type B receptor
Type:
Enzyme Catalytic Domain
Mol. Mass.:
49196.59
Organism:
MOUSE
Description:
Cholecystokinin A CCKBR MOUSE::P56481
Residue:
453
  
Inhibitor
Name:
BDBM50006842
Synonyms:
2-[2-(5-Bromo-1H-indol-3-yl)-ethyl]-3-(3-isopropoxy-phenyl)-3H-quinazolin-4-one | CHEMBL37312
Type:
Small organic molecule
Emp. Form.:
C27H24BrN3O2
Mol. Mass.:
502.402
SMILES:
CC(C)Oc1cccc(c1)-n1c(CCc2c[nH]c3ccc(Br)cc23)nc2ccccc2c1=O
: