Target
LIM domain kinase 1
Ligand
BDBM50299584
Substrate
Meas. Tech.
ChEMBL_592394 (CHEMBL1036967)
IC50
3.7±n/a nM
Citation
 Harrison, BAWhitlock, NAVoronkov, MVAlmstead, ZYGu, KJMabon, RGardyan, MHamman, BDAllen, JGopinathan, SMcKnight, BCrist, MZhang, YLiu, YCourtney, LFKey, BZhou, JPatel, NYates, PWLiu, QWilson, AGKimball, SDCrosson, CERice, DSRawlins, DB Novel class of LIM-kinase 2 inhibitors for the treatment of ocular hypertension and associated glaucoma. J Med Chem 52:6515-8 (2009)  
Target
Name:
LIM domain kinase 1
Synonyms:
LIMK LIMK1 | LIMK1_HUMAN
Type:
Enzyme Catalytic Domain
Mol. Mass.:
72591.81
Organism:
Homo sapiens (Human)
Description:
gi_4505001
Residue:
647
  
Inhibitor
Name:
BDBM50299584
Synonyms:
(S)-N-(3-bromo-4-fluorophenyl)-N'-cyano-2-methyl-4-(5-methyl-7H-pyrrolo[2,3-d]pyrimidin-4-yl)piperazine-1-carboximidamide | CHEMBL565452
Type:
Small organic molecule
Emp. Form.:
C20H20BrFN8
Mol. Mass.:
471.329
SMILES:
C[C@H]1CN(CCN1C(NC#N)=Nc1ccc(F)c(Br)c1)c1ncnc2[nH]cc(C)c12
: