Target
LIM domain kinase 2
Ligand
BDBM50299622
Substrate
Meas. Tech.
ChEMBL_592392 (CHEMBL1036965)
IC50
3.4±n/a nM
Citation
 Harrison, BAWhitlock, NAVoronkov, MVAlmstead, ZYGu, KJMabon, RGardyan, MHamman, BDAllen, JGopinathan, SMcKnight, BCrist, MZhang, YLiu, YCourtney, LFKey, BZhou, JPatel, NYates, PWLiu, QWilson, AGKimball, SDCrosson, CERice, DSRawlins, DB Novel class of LIM-kinase 2 inhibitors for the treatment of ocular hypertension and associated glaucoma. J Med Chem 52:6515-8 (2009)  
Target
Name:
LIM domain kinase 2
Synonyms:
LIMK2 | LIMK2_HUMAN
Type:
PROTEIN
Mol. Mass.:
72238.81
Organism:
Homo sapiens (Human)
Description:
ChEMBL_1514398
Residue:
638
  
Inhibitor
Name:
BDBM50299622
Synonyms:
(S)-3-(N'-cyano-2-methyl-4-(5-methyl-7H-pyrrolo[2,3-d]pyrimidin-4-yl)piperazine-1-carboximidamido)-N-(2-(dimethylamino)ethyl)benzamide | CHEMBL571940
Type:
Small organic molecule
Emp. Form.:
C25H32N10O
Mol. Mass.:
488.588
SMILES:
C[C@H]1CN(CCN1C(NC#N)=Nc1cccc(c1)C(=O)NCCN(C)C)c1ncnc2[nH]cc(C)c12
: