Target
11-beta-hydroxysteroid dehydrogenase 1
Ligand
BDBM50306425
Substrate
Meas. Tech.
ChEMBL_609882 (CHEMBL1073438)
IC50
18.3±n/a nM
Citation
 Tice, CMZhao, WXu, ZCacatian, STSimpson, RDYe, YJSingh, SBMcKeever, BMLindblom, PGuo, JKrosky, PMKruk, BABerbaum, JHarrison, RKJohnson, JJBukhtiyarov, YPanemangalore, RScott, BBZhao, YBruno, JGZhuang, LMcGeehan, GMHe, WClaremon, DA Spirocyclic ureas: orally bioavailable 11beta-HSD1 inhibitors identified by computer-aided drug design. Bioorg Med Chem Lett 20:881-6 (2010)  
Target
Name:
11-beta-hydroxysteroid dehydrogenase 1
Synonyms:
11-DH 11-beta-Hydroxysteroid Dehydrogenase 1 (11-beta-HSD1) 11-beta-hydroxysteroid dehydrogenase 1 (11HSD1) Corticosteroid 11-beta-dehydrogenase isozyme 1 (11-beta-HSD-1) Corticosteroid 11-beta-dehydrogenase isozyme 1 (11beta-HSD1) HSD11 HSD11L | SDR26C1
Type:
Enzyme
Mol. Mass.:
32409.16
Organism:
Homo sapiens (Human)
Description:
P28845
Residue:
292
  
Inhibitor
Name:
BDBM50306425
Synonyms:
2-{1'-[(adamantan-2-yl)carbamoyl]-7-methyl-2,3-dihydrospiro[indene-1,4'-piperidine]-3-yl}acetic acid | CHEMBL605756
Type:
Small organic molecule
Emp. Form.:
C27H36N2O3
Mol. Mass.:
436.5863
SMILES:
Cc1cccc2C(CC(O)=O)CC3(CCN(CC3)C(=O)NC3C4CC5CC(C4)CC3C5)c12
: