Target
Sphingosine 1-phosphate receptor 4
Ligand
BDBM50314401
Substrate
Meas. Tech.
ChEMBL_624585 (CHEMBL1111545)
EC50
5.39±n/a nM
Citation
 Ma, BGuckian, KMLin, EYLee, WCScott, DKumaravel, GMacdonald, TLLynch, KRBlack, CChollate, SHahm, KHetu, GJin, PLuo, YRohde, ERossomando, AScannevin, RWang, JYang, C Stereochemistry-activity relationship of orally active tetralin S1P agonist prodrugs. Bioorg Med Chem Lett 20:2264-9 (2010)  
Target
Name:
Sphingosine 1-phosphate receptor 4
Synonyms:
EDG6 S1P receptor 4 S1P4 S1PR4_HUMAN Sphingosine 1-phosphate receptor Edg-6 sphingosine-1-phosphate 4 S1P4
Type:
G Protein-Coupled Receptor (GPCR)
Mol. Mass.:
41647.39
Organism:
Homo sapiens (Human)
Description:
Residue:
384
  
Inhibitor
Name:
BDBM50314401
Synonyms:
2-amino-3-hydroxy-2-((R)-6-octyl-1,2,3,4-tetrahydronaphthalen-2-yl)propyl dihydrogen phosphate | CHEMBL1091103
Type:
Small organic molecule
Emp. Form.:
C21H36NO5P
Mol. Mass.:
413.488
SMILES:
CCCCCCCCc1ccc2C[C@@H](CCc2c1)C(N)(CO)COP(O)(O)=O
: