Target
Sphingosine 1-phosphate receptor 5
Ligand
BDBM50314402
Substrate
Meas. Tech.
ChEMBL_624586 (CHEMBL1111546)
EC50
1.49±n/a nM
Citation
 Ma, BGuckian, KMLin, EYLee, WCScott, DKumaravel, GMacdonald, TLLynch, KRBlack, CChollate, SHahm, KHetu, GJin, PLuo, YRohde, ERossomando, AScannevin, RWang, JYang, C Stereochemistry-activity relationship of orally active tetralin S1P agonist prodrugs. Bioorg Med Chem Lett 20:2264-9 (2010)  
Target
Name:
Sphingosine 1-phosphate receptor 5
Synonyms:
EDG8 S1P5 S1PR5_HUMAN Sphingosine 1-phosphate receptor Edg-8
Type:
G Protein-Coupled Receptor (GPCR)
Mol. Mass.:
41796.42
Organism:
Homo sapiens (Human)
Description:
Residue:
398
  
Inhibitor
Name:
BDBM50314402
Synonyms:
(R)-2-amino-2-((S)-6-octyl-1,2,3,4-tetrahydronaphthalen-2-yl)propyl dihydrogen phosphate | CHEMBL1093686
Type:
Small organic molecule
Emp. Form.:
C21H36NO4P
Mol. Mass.:
397.4886
SMILES:
CCCCCCCCc1ccc2C[C@H](CCc2c1)[C@@](C)(N)COP(O)(O)=O
: