Target
Sialidase
Ligand
BDBM50241454
Substrate
Meas. Tech.
ChEMBL_652518 (CHEMBL1225721)
IC50
60700±n/a nM
Citation
 Ryu, HWCurtis-Long, MJJung, SJin, YMCho, JKRyu, YBLee, WSPark, KH Xanthones with neuraminidase inhibitory activity from the seedcases of Garcinia mangostana. Bioorg Med Chem 18:6258-64 (2010)  
Target
Name:
Sialidase
Synonyms:
NANH_CLOPF | nanH
Type:
PROTEIN
Mol. Mass.:
42808.79
Organism:
Clostridium perfringens
Description:
ChEMBL_991336
Residue:
382
  
Inhibitor
Name:
BDBM50241454
Synonyms:
1,6-dihydroxy-3,7-dimethoxy-2,8-bis(3-methylbut-2-enyl)-9H-xanthen-9-one beta-mangostin
Type:
Small organic molecule
Emp. Form.:
C25H28O6
Mol. Mass.:
424.4862
SMILES:
[#6]-[#8]-c1cc2oc3cc(-[#8])c(-[#8]-[#6])c(-[#6]\[#6]=[#6](\[#6])-[#6])c3c(=O)c2c(-[#8])c1-[#6]\[#6]=[#6](\[#6])-[#6]
: