Target
Disintegrin and metalloproteinase domain-containing protein 17
Ligand
BDBM50342962
Substrate
Meas. Tech.
ChEMBL_744255 (CHEMBL1772062)
Ki
0.500000±n/a nM
Citation
 Dai, CLi, DPopovici-Muller, JZhao, LGirijavallabhan, VMRosner, KELavey, BJRizvi, RShankar, BBWong, MKGuo, ZOrth, PStrickland, COSun, JNiu, XChen, SKozlowski, JALundell, DJPiwinski, JJShih, NYSiddiqui, MA 2-(2-Aminothiazol-4-yl)pyrrolidine-based tartrate diamides as potent, selective and orally bioavailable TACE inhibitors. Bioorg Med Chem Lett 21:3172-6 (2011)  
Target
Name:
Disintegrin and metalloproteinase domain-containing protein 17
Synonyms:
ADA17_HUMAN CSVP Disintegrin and metalloproteinase domain-containing protein 17 (ADAM17) TNF-alpha convertase TNF-alpha-converting enzyme (TACE) Tumor necrosis factor-α converting enzyme (TACE)
Type:
Enzyme
Mol. Mass.:
93007.89
Organism:
Homo sapiens (Human)
Description:
Residue:
824
  
Inhibitor
Name:
BDBM50342962
Synonyms:
(2R,3R)-4-((R)-2-amino-5-(2-(ethylamino)thiazol-4-yl)-5H-pyrrolo[3,4-d]pyrimidin-6(7H)-yl)-N-((R)-1-(4-(cyclopenta-2,4-dienyl)phenyl)ethyl)-2,3-dihydroxy-4-oxobutanamide | CHEMBL1770829
Type:
Small organic molecule
Emp. Form.:
C26H29N9O4S
Mol. Mass.:
563.631
SMILES:
CCNc1nc(cs1)[C@@H]1N(Cc2nc(N)ncc12)C(=O)[C@H](O)[C@@H](O)C(=O)N[C@H](C)c1ccc(cc1)-n1cccn1
: