Target
Sigma non-opioid intracellular receptor 1
Ligand
BDBM50343622
Substrate
Meas. Tech.
ChEMBL_746382 (CHEMBL1776341)
Ki
0.91±n/a nM
Citation
 Li, ZJRen, HYCui, MCDeuther-Conrad, WTang, RKSteinbach, JBrust, PLiu, BLJia, HM Synthesis and biological evaluation of novel 4-benzylpiperazine ligands for sigma-1 receptor imaging. Bioorg Med Chem 19:2911-7 (2011)  
Target
Name:
Sigma non-opioid intracellular receptor 1
Synonyms:
Opioid receptor SGMR1_RAT Sigma non-opioid intracellular receptor 1 Sigma-1 | Sigmar1
Type:
Enzyme Catalytic Domain
Mol. Mass.:
25266.54
Organism:
RAT
Description:
Q9R0C9
Residue:
223
  
Inhibitor
Name:
BDBM50343622
Synonyms:
1-(1,3-Benzodioxol-5-ylmethyl)-4-(4-methylbenzyl)-piperazine | CHEMBL1774732
Type:
Small organic molecule
Emp. Form.:
C20H24N2O2
Mol. Mass.:
324.4168
SMILES:
Cc1ccc(CN2CCN(Cc3ccc4OCOc4c3)CC2)cc1
: