Target
Acid-sensing ion channel 3
Ligand
BDBM50348108
Substrate
Meas. Tech.
ChEMBL_757561 (CHEMBL1804676)
IC50
10200±n/a nM
Citation
 Kuduk, SDChang, RKDi Marco, CNDipardo, RMCook, SPCato, MJJovanovska, AUrban, MOLeitl, MSpencer, RHKane, SAHartman, GDBilodeau, MT Identification of non-amidine inhibitors of acid-sensing ion channel-3 (ASIC3). Bioorg Med Chem Lett 21:4255-8 (2011)  
Target
Name:
Acid-sensing ion channel 3
Synonyms:
ACCN3 ASIC3_HUMAN SLNAC1 | TNAC1
Type:
PROTEIN
Mol. Mass.:
58910.26
Organism:
Homo sapiens (Human)
Description:
ChEMBL_757561
Residue:
531
  
Inhibitor
Name:
BDBM50348108
Synonyms:
CHEMBL1800434
Type:
Small organic molecule
Emp. Form.:
C22H19ClF2N2S
Mol. Mass.:
416.914
SMILES:
NCc1sc2cc(ccc2c1Cl)C#Cc1ccc2CCN(CC(F)F)Cc2c1
: