Target
Acetyl-CoA carboxylase 2
Ligand
BDBM50355934
Substrate
Meas. Tech.
ChEMBL_775975 (CHEMBL1912973)
IC50
5.4±n/a nM
Citation
 Yamashita, TKamata, MEndo, SYamamoto, MKakegawa, KWatanabe, HMiwa, KYamano, TFunata, MSakamoto, JTani, AMol, CDZou, HDougan, DRSang, BSnell, GFukatsu, K Design, synthesis, and structure-activity relationships of spirolactones bearing 2-ureidobenzothiophene as acetyl-CoA carboxylases inhibitors. Bioorg Med Chem Lett 21:6314-8 (2011)  
Target
Name:
Acetyl-CoA carboxylase 2
Synonyms:
ACACB ACC-beta ACCB Acetyl-CoA carboxylase 2 Acetyl-CoA carboxylase 2 (ACC2)
Type:
Protein
Mol. Mass.:
276535.21
Organism:
Homo sapiens (Human)
Description:
O00763
Residue:
2458
  
Inhibitor
Name:
BDBM50355934
Synonyms:
CHEMBL1910404
Type:
Small organic molecule
Emp. Form.:
C27H36N4O4S
Mol. Mass.:
512.664
SMILES:
CCNC(=O)Nc1sc2ccccc2c1C(=O)N1CCC(CC1)N1CCC[C@]2(CC(C)(C)OC2=O)C1
: