Target
Neuronal acetylcholine receptor subunit alpha-7
Ligand
BDBM50356464
Substrate
Meas. Tech.
ChEMBL_775797 (CHEMBL1912300)
Ki
140±n/a nM
Citation
 Kombo, DCMazurov, ATallapragada, KHammond, PSChewning, JHauser, TAVasquez-Valdivieso, MYohannes, DTalley, TTTaylor, PCaldwell, WS Docking studies of benzylidene anabaseine interactions witha7 nicotinic acetylcholine receptor (nAChR) and acetylcholine binding proteins (AChBPs): application to the design of relateda7 selective ligands. Eur J Med Chem 46:5625-35 (2011)  
Target
Name:
Neuronal acetylcholine receptor subunit alpha-7
Synonyms:
ACHA7_RAT Cholinergic, Nicotinic Alpha7 Chrna7 Neuronal acetylcholine receptor (alpha7 nAChR) Neuronal acetylcholine receptor subunit alpha-7 Neuronal acetylcholine receptor subunit alpha-7 (nAChR)
Type:
Enzyme
Mol. Mass.:
56502.44
Organism:
Rattus norvegicus (Rat)
Description:
Q05941
Residue:
502
  
Inhibitor
Name:
BDBM50356464
Synonyms:
CHEMBL1911852
Type:
Small organic molecule
Emp. Form.:
C17H21N3O
Mol. Mass.:
283.3681
SMILES:
O=C1CC(=NCC2(CN3CCC2CC3)N1)c1ccccc1
: