Target
Neuronal acetylcholine receptor subunit alpha-7
Ligand
BDBM50061564
Substrate
Meas. Tech.
ChEMBL_775797 (CHEMBL1912300)
Ki
1300±n/a nM
Citation
 Kombo, DCMazurov, ATallapragada, KHammond, PSChewning, JHauser, TAVasquez-Valdivieso, MYohannes, DTalley, TTTaylor, PCaldwell, WS Docking studies of benzylidene anabaseine interactions witha7 nicotinic acetylcholine receptor (nAChR) and acetylcholine binding proteins (AChBPs): application to the design of relateda7 selective ligands. Eur J Med Chem 46:5625-35 (2011)  
Target
Name:
Neuronal acetylcholine receptor subunit alpha-7
Synonyms:
ACHA7_RAT Cholinergic, Nicotinic Alpha7 Chrna7 Neuronal acetylcholine receptor (alpha7 nAChR) Neuronal acetylcholine receptor subunit alpha-7 Neuronal acetylcholine receptor subunit alpha-7 (nAChR)
Type:
Enzyme
Mol. Mass.:
56502.44
Organism:
Rattus norvegicus (Rat)
Description:
Q05941
Residue:
502
  
Inhibitor
Name:
BDBM50061564
Synonyms:
(3E)-3-[(2,4-DIMETHOXYPHENYL)METHYLIDENE]-3,4,5,6-TETRAHYDRO-2,3'-BIPYRIDINE 3-(3-(2,4-dimethoxybenzylidene)-3,4,5,6-tetrahydropyridin-2-yl)pyridine 3-[1-(2,4-Dimethoxy-phenyl)-meth-(E)-ylidene]-3,4,5,6-tetrahydro-[2,3']bipyridinyl | CHEMBL134713
Type:
Small organic molecule
Emp. Form.:
C19H20N2O2
Mol. Mass.:
308.3743
SMILES:
COc1ccc(\C=C2/CCCN=C2c2cccnc2)c(OC)c1
: