Target
MAP kinase-activated protein kinase 5
Ligand
BDBM50365785
Substrate
Meas. Tech.
ChEMBL_806118 (CHEMBL1960721)
IC50
914±n/a nM
Citation
 Andrews, MJClase, JABar, GTricarico, GEdwards, PJBrys, RChambers, MSchmidt, WMacLeod, AHirst, KAllen, VBirault, VLe, JHarris, JSelf, ANash, KDixon, G Discovery of a series of imidazopyrazine small molecule inhibitors of the kinase MAPKAPK5, that show activity using in vitro and in vivo models of rheumatoid arthritis. Bioorg Med Chem Lett 22:2266-70 (2012)  
Target
Name:
MAP kinase-activated protein kinase 5
Synonyms:
MAP kinase-activated protein kinase 5 (PRAK) MAPK-activated protein kinase 5 MAPKAP kinase 5 PRAK p38-regulated/activated protein kinase (PRAK)
Type:
Serine/threonine-protein kinase
Mol. Mass.:
54229.92
Organism:
Homo sapiens (Human)
Description:
Recombinant MAPKAPK5 was phosphorylated by incubation with active p38alpha before assays.
Residue:
473
  
Inhibitor
Name:
BDBM50365785
Synonyms:
CHEMBL1956564
Type:
Small organic molecule
Emp. Form.:
C23H22N6O2
Mol. Mass.:
414.4598
SMILES:
NC(=O)c1ccc(cc1)-c1cnc(Nc2ccc(cc2)N2CCOCC2)c2nccn12
: