Target
Gag-Pol polyprotein [489-587]
Ligand
BDBM50212827
Substrate
Meas. Tech.
ChEMBL_157566 (CHEMBL873418)
Ki
<1±n/a nM
Citation
 Sawyer, TFisher, JHester, JSmith, CTomasselli, ATarpley, WBurton, PHui, JMcQuade, TConradi, RBradford, VLiu, LKinner, JTustin, JAlexander, DHarrison, AEmmert, DStaples, DMaggiora, LZhang, YPoorman, RDunna, BRao, CScarborough, PLowther, WCraik, CDeCamp, DMoon, JHowe, WHeinrikson, R Peptidomimetic inhibitors of human immunodeficiency virus protease (HIV-PR): Design, enzyme binding and selectivity, antiviral efficacy, and cell permeability properties Bioorg Med Chem Lett 3:819-824 (1993)    Article 
Target
Name:
Gag-Pol polyprotein [489-587]
Synonyms:
Human immunodeficiency virus type 1 protease Pol polyprotein | gag-pol
Type:
Enzyme Subunit
Mol. Mass.:
10781.16
Organism:
Human immunodeficiency virus type 1
Description:
P04585[489-587]
Residue:
99
  
Inhibitor
Name:
BDBM50212827
Synonyms:
CHEMBL3350189
Type:
Small organic molecule
Emp. Form.:
C45H61N7O7
Mol. Mass.:
812.0085
SMILES:
CC[C@H](C)[C@H](NC(=O)[C@H](C(C)C)[C@@H](O)[C@H](O)[C@H](CC1CCCCC1)NC(=O)[C@H](Cc1c[nH]cn1)NC(=O)COc1cccc2ccccc12)C(=O)NCc1ccccn1
: