Target
Aromatase
Ligand
BDBM50008724
Substrate
Meas. Tech.
ChEMBL_50699 (CHEMBL663244)
IC50
93±n/a nM
Citation
 Browne, LJGude, CRodriguez, HSteele, REBhatnager, A Fadrozole hydrochloride: a potent, selective, nonsteroidal inhibitor of aromatase for the treatment of estrogen-dependent disease. J Med Chem 34:725-36 (1991)  
Target
Name:
Aromatase
Synonyms:
ARO1 CP19A_HUMAN CYP19 CYPXIX Cytochrome P450 19A1 Cytochrome P450-C19 (CYP19) FL cytokine receptor precursor | P-450AROM
Type:
Enzyme
Mol. Mass.:
57888.92
Organism:
Homo sapiens (Human)
Description:
P11511
Residue:
503
  
Inhibitor
Name:
BDBM50008724
Synonyms:
4-(5,6,7,8-Tetrahydro-imidazo[1,5-a]pyridin-5-yl)-butyronitrile | CHEMBL163420
Type:
Small organic molecule
Emp. Form.:
C11H15N3
Mol. Mass.:
189.2569
SMILES:
N#CCCCC1CCCc2cncn12
: