Target
Renin
Ligand
BDBM50011704
Substrate
Meas. Tech.
ChEMBL_195927 (CHEMBL803396)
pH
7.4±n/a
IC50
1.3±n/a nM
Comments
extracted
Citation
 Williams, PDPerlow, DSPayne, LSHolloway, MKSiegl, PKSchorn, TWLynch, RJDoyle, JJStrouse, JFVlasuk, GP Renin inhibitors containing conformationally restricted P1-P1' dipeptide mimetics. J Med Chem 34:887-900 (1991)  
Target
Name:
Renin
Synonyms:
Angiotensinogenase RENI_HUMAN
Type:
Enzyme
Mol. Mass.:
45058.99
Organism:
Homo sapiens (Human)
Description:
Residue:
406
  
Inhibitor
Name:
BDBM50011704
Synonyms:
CHEMBL170504 | {1-[1-[1-Cyclohexylmethyl-2-hydroxy-2-(1,5,5-trimethyl-2-oxo-pyrrolidin-3-yl)-ethylcarbamoyl]-2-(1H-imidazol-4-yl)-ethylcarbamoyl]-2-phenyl-ethyl}-carbamic acid tert-butyl ester
Type:
Small organic molecule
Emp. Form.:
C36H54N6O6
Mol. Mass.:
666.8506
SMILES:
CN1C(=O)[C@@H](CC1(C)C)[C@H](O)[C@H](CC1CCCCC1)NC(=O)[C@H](Cc1cnc[nH]1)NC(=O)[C@H](Cc1ccccc1)NC(=O)OC(C)(C)C
: