Target
Pepsin A
Ligand
BDBM50011707
Substrate
Meas. Tech.
ChEBML_153854
IC50
1000±n/a nM
Citation
 Williams, PDPerlow, DSPayne, LSHolloway, MKSiegl, PKSchorn, TWLynch, RJDoyle, JJStrouse, JFVlasuk, GP Renin inhibitors containing conformationally restricted P1-P1' dipeptide mimetics. J Med Chem 34:887-900 (1991)  
Target
Name:
Pepsin A
Synonyms:
PEPA_PIG Pepsin | Pepsin A precursor
Type:
Enzyme
Mol. Mass.:
41232.87
Organism:
Porcine
Description:
Residue:
385
  
Inhibitor
Name:
BDBM50011707
Synonyms:
CHEMBL405692 | {1-[1-[1-Cyclohexylmethyl-2-hydroxy-2-(5-hydroxymethyl-1-methyl-2-oxo-pyrrolidin-3-yl)-ethylcarbamoyl]-2-(1H-imidazol-4-yl)-ethylcarbamoyl]-2-phenyl-ethyl}-carbamic acid tert-butyl ester
Type:
Small organic molecule
Emp. Form.:
C35H52N6O7
Mol. Mass.:
668.8234
SMILES:
CN1[C@H](CO)C[C@@H]([C@H](O)[C@H](CC2CCCCC2)NC(=O)[C@H](Cc2cnc[nH]2)NC(=O)[C@H](Cc2ccccc2)NC(=O)OC(C)(C)C)C1=O
: