Target
Gastricsin
Ligand
BDBM50011706
Substrate
Meas. Tech.
ChEBML_71510
IC50
1000±n/a nM
Citation
 Williams, PDPerlow, DSPayne, LSHolloway, MKSiegl, PKSchorn, TWLynch, RJDoyle, JJStrouse, JFVlasuk, GP Renin inhibitors containing conformationally restricted P1-P1' dipeptide mimetics. J Med Chem 34:887-900 (1991)  
Target
Name:
Gastricsin
Synonyms:
Gastricsin PGC | Pepsinogen C
Type:
PROTEIN
Mol. Mass.:
42409.17
Organism:
Homo sapiens (Human)
Description:
ChEMBL_1452207
Residue:
388
  
Inhibitor
Name:
BDBM50011706
Synonyms:
CHEMBL353944 | {1-[1-[2-(1-Butyl-5,5-dimethyl-2-oxo-pyrrolidin-3-yl)-1-cyclohexylmethyl-2-hydroxy-ethylcarbamoyl]-2-(1H-imidazol-4-yl)-ethylcarbamoyl]-2-phenyl-ethyl}-carbamic acid tert-butyl ester
Type:
Small organic molecule
Emp. Form.:
C39H60N6O6
Mol. Mass.:
708.9303
SMILES:
CCCCN1C(=O)[C@@H](CC1(C)C)[C@H](O)[C@H](CC1CCCCC1)NC(=O)[C@H](Cc1cnc[nH]1)NC(=O)[C@H](Cc1ccccc1)NC(=O)OC(C)(C)C
: