Target
Endothelin receptor type B
Ligand
BDBM50000741
Substrate
Meas. Tech.
ChEBML_63870
IC50
30000±n/a nM
Citation
 Ishikawa, KFukami, TNagase, TFujita, KHayama, TNiiyama, KMase, TIhara, MYano, M Cyclic pentapeptide endothelin antagonists with high ETA selectivity. Potency- and solubility-enhancing modifications. J Med Chem 35:2139-42 (1992)  
Target
Name:
Endothelin receptor type B
Synonyms:
EDNRB ENDOTHELIN B ETRB Endothelin receptor non-selective type | Endothelin receptor, ET-A/ET-B
Type:
Enzyme Catalytic Domain
Mol. Mass.:
49664.00
Organism:
Homo sapiens (Human)
Description:
ENDOTHELIN B EDNRB HUMAN::P24530
Residue:
442
  
Inhibitor
Name:
BDBM50000741
Synonyms:
CHEMBL293874 | [14-(1H-Indol-3-ylmethyl)-11-isobutyl-8-isopropyl-4-methyl-3,6,9,12,15-pentaoxo-1,4,7,10,13pentaaza-cyclopentadec-2-yl]-acetic acid
Type:
Small organic molecule
Emp. Form.:
C29H40N6O7
Mol. Mass.:
584.6639
SMILES:
CC(C)C[C@@H]1NC(=O)[C@@H](NC(=O)CN(C)C(=O)[C@H](CC(O)=O)NC(=O)[C@@H](Cc2c[nH]c3ccccc23)NC1=O)C(C)C
: