Target
Substance-P receptor
Ligand
BDBM50002385
Substrate
Meas. Tech.
ChEBML_208658
IC50
>10000±n/a nM
Citation
 Venepalli, BRAimone, LDAppell, KCBell, MRDority, JAGoswami, RHall, PLKumar, VLawrence, KBLogan, ME Synthesis and substance P receptor binding activity of androstano[3,2-b]pyrimido[1,2-a]benzimidazoles. J Med Chem 35:374-8 (1992)  
Target
Name:
Substance-P receptor
Synonyms:
NK-1 receptor NK1 Receptor Neurokinin 1 receptor SPR Tac1r Tacr1
Type:
G Protein-Coupled Receptor (GPCR)
Mol. Mass.:
46371.54
Organism:
Rattus norvegicus (rat)
Description:
Competition binding assays were carried out using membrane preparations from transfected CHO cells that constitutively expressed the rat NK1 receptor.
Residue:
407
  
Inhibitor
Name:
BDBM50002385
Synonyms:
1-(1-ethynyl)-15a,17a-dimethyl-(1R,5aS,15aS,17aS)-2,3,3a,3b,4,5,5a,6,15,15a,15b,16,17,17a-tetradecahydro-1H-cyclopenta[5,6]naphtho[1,2-g]indolo[2,1-b]quinazolin-1-ol(0.25MCH3OH) | CHEMBL122105
Type:
Small organic molecule
Emp. Form.:
C30H34N2O
Mol. Mass.:
438.6038
SMILES:
C[C@]12CCC3C(CC[C@H]4Cc5nc6cc7ccccc7n6cc5C[C@]34C)C1CC[C@@]2(O)C#C
: