Target
Transient receptor potential cation channel subfamily V member 1
Ligand
BDBM20461
Substrate
Meas. Tech.
ChEMBL_215635 (CHEMBL820953)
Ki
2000±n/a nM
Citation
 Walpole, CSBevan, SBloomfield, GBreckenridge, RJames, IFRitchie, TSzallasi, AWinter, JWrigglesworth, R Similarities and differences in the structure-activity relationships of capsaicin and resiniferatoxin analogues. J Med Chem 39:2939-52 (1996)  
Target
Name:
Transient receptor potential cation channel subfamily V member 1
Synonyms:
Capsaicin receptor TRPV1_RAT Trpv1 Vanilloid VR1 Vanilloid receptor 1 (VRI/TRPV1) Vanilloid receptor type 1-like (TrpV1/Vr1) Vr1l | osm-9-like TRP channel 1
Type:
Transient Receptor
Mol. Mass.:
94956.12
Organism:
Rattus norvegicus (rat)
Description:
O35433
Residue:
838
  
Inhibitor
Name:
BDBM20461
Synonyms:
(6E)-N-[(4-hydroxy-3-methoxyphenyl)methyl]-8-methylnon-6-enamide CAP Capsaicin | Zostrix
Type:
Emp. Form.:
C18H27NO3
Mol. Mass.:
305.4119
SMILES:
COc1cc(CNC(=O)CCCC\C=C\C(C)C)ccc1O
: