Target
Prothrombin
Ligand
BDBM50366827
Substrate
Meas. Tech.
ChEMBL_208888 (CHEMBL814945)
Ki
5±n/a nM
Citation
 Tucker, TJLumma, WCMulichak, AMChen, ZNaylor-Olsen, AMLewis, SDLucas, RFreidinger, RMKuo, LC Design of highly potent noncovalent thrombin inhibitors that utilize a novel lipophilic binding pocket in the thrombin active site. J Med Chem 40:830-2 (1997)  
Target
Name:
Prothrombin
Synonyms:
Activation peptide fragment 1 Coagulation factor II Prothrombin precursor Thrombin heavy chain | Thrombin light chain
Type:
Protein
Mol. Mass.:
70029.57
Organism:
Homo sapiens (Human)
Description:
P00734
Residue:
622
  
Inhibitor
Name:
BDBM50366827
Synonyms:
CHEMBL125181 | L-371912
Type:
Small organic molecule
Emp. Form.:
C22H34N4O2
Mol. Mass.:
386.531
SMILES:
CN[C@H](Cc1ccccc1)C(=O)N1CCC[C@H]1C(=O)NC[C@H]1CC[C@H](N)CC1
: