Target
Serine protease 1
Ligand
BDBM50056769
Substrate
Meas. Tech.
ChEMBL_212733 (CHEMBL819274)
Ki
4±n/a nM
Citation
 Tucker, TJLumma, WCMulichak, AMChen, ZNaylor-Olsen, AMLewis, SDLucas, RFreidinger, RMKuo, LC Design of highly potent noncovalent thrombin inhibitors that utilize a novel lipophilic binding pocket in the thrombin active site. J Med Chem 40:830-2 (1997)  
Target
Name:
Serine protease 1
Synonyms:
Alpha-trypsin chain 1 Beta-trypsin PRSS1 TRP1 TRY1_HUMAN Thrombin & trypsin Trypsin I | Trypsin-1
Type:
Enzyme
Mol. Mass.:
26557.80
Organism:
Homo sapiens (Human)
Description:
P07477
Residue:
247
  
Inhibitor
Name:
BDBM50056769
Synonyms:
(S)-1-(3,3-Diphenyl-2-phenylmethanesulfonylamino-propionyl)-pyrrolidine-2-carboxylic acid (4-amino-cyclohexylmethyl)-amide | CHEMBL436454
Type:
Small organic molecule
Emp. Form.:
C34H42N4O4S
Mol. Mass.:
602.787
SMILES:
NC1CCC(CNC(=O)[C@@H]2CCCN2C(=O)C(NS(=O)(=O)Cc2ccccc2)C(c2ccccc2)c2ccccc2)CC1
: