Target
Kappa-type opioid receptor
Ligand
BDBM50271816
Substrate
Meas. Tech.
ChEMBL_145797 (CHEMBL756064)
IC50
3015±n/a nM
Citation
 Houghten, RAPinilla, CAppel, JRBlondelle, SEDooley, CTEichler, JNefzi, AOstresh, JM Mixture-based synthetic combinatorial libraries. J Med Chem 42:3743-78 (1999)  
Target
Name:
Kappa-type opioid receptor
Synonyms:
K-OR-1 Kappa-opioid receptor (KOR) Kappa-type opioid receptor (KOR) OPIATE Kappa OPRK1 kappa opioid receptor (KOR)
Type:
G Protein-Coupled Receptor (GPCR)
Mol. Mass.:
42648.76
Organism:
Homo sapiens (Human)
Description:
P41145
Residue:
380
  
Inhibitor
Name:
BDBM50271816
Synonyms:
(3S,6S)-7-(2-Bicyclo[2.2.1]hept-2-yl-ethyl)-6-(4-methoxy-benzyl)-3-methyl-2,5,6,7-tetrahydro-3H-imidazo[1,2-a]imidazol-1-ium
Type:
Small organic molecule
Emp. Form.:
C23H34N3O
Mol. Mass.:
368.535
SMILES:
COc1ccc(C[C@H]2CN3[C@@H](C)C[NH+]=C3N2CCC2CC3CCC2C3)cc1
: