Target
Kappa-type opioid receptor
Ligand
BDBM50271772
Substrate
Meas. Tech.
ChEMBL_145851 (CHEMBL756114)
IC50
37±n/a nM
Citation
 Houghten, RAPinilla, CAppel, JRBlondelle, SEDooley, CTEichler, JNefzi, AOstresh, JM Mixture-based synthetic combinatorial libraries. J Med Chem 42:3743-78 (1999)  
Target
Name:
Kappa-type opioid receptor
Synonyms:
K-OR-1 Kappa-opioid receptor (KOR) Kappa-type opioid receptor (KOR) OPIATE Kappa OPRK1 kappa opioid receptor (KOR)
Type:
G Protein-Coupled Receptor (GPCR)
Mol. Mass.:
42648.76
Organism:
Homo sapiens (Human)
Description:
P41145
Residue:
380
  
Inhibitor
Name:
BDBM50271772
Synonyms:
(3S,6S)-7-(3-Cyclohexyl-propyl)-6-(4-methoxy-benzyl)-3-methyl-2,5,6,7-tetrahydro-3H-imidazo[1,2-a]imidazol-1-ium
Type:
Small organic molecule
Emp. Form.:
C23H36N3O
Mol. Mass.:
370.5509
SMILES:
COc1ccc(C[C@H]2CN3[C@@H](C)C[NH+]=C3N2CCCC2CCCCC2)cc1
: