Target
Kappa-type opioid receptor
Ligand
BDBM50272035
Substrate
Meas. Tech.
ChEMBL_145851 (CHEMBL756114)
IC50
804±n/a nM
Citation
 Houghten, RAPinilla, CAppel, JRBlondelle, SEDooley, CTEichler, JNefzi, AOstresh, JM Mixture-based synthetic combinatorial libraries. J Med Chem 42:3743-78 (1999)  
Target
Name:
Kappa-type opioid receptor
Synonyms:
K-OR-1 Kappa-opioid receptor (KOR) Kappa-type opioid receptor (KOR) OPIATE Kappa OPRK1 kappa opioid receptor (KOR)
Type:
G Protein-Coupled Receptor (GPCR)
Mol. Mass.:
42648.76
Organism:
Homo sapiens (Human)
Description:
P41145
Residue:
380
  
Inhibitor
Name:
BDBM50272035
Synonyms:
(2S,5R)-5-cyclohexyl-2-[(4-methoxyphenyl)methyl]-1-[(4-methylcyclohexyl)methyl]-1H,2H,3H,5H,6H-imidazo[1,2-a]imidazolidin-7-ium
Type:
Small organic molecule
Emp. Form.:
C27H42N3O
Mol. Mass.:
424.6413
SMILES:
COc1ccc(CC2C[N+]3=C(NCC3C3CCCCC3)N2CC2CCC(C)CC2)cc1
: