Target
Delta-type opioid receptor
Ligand
BDBM50098448
Substrate
Meas. Tech.
ChEMBL_146896 (CHEMBL751670)
Ki
141±n/a nM
Citation
 Thomas, JBHerault, XMRothman, RBAtkinson, RNBurgess, JPMascarella, SWDersch, CMXu, HFlippen-Anderson, JLGeorge, CFCarroll, FI Factors influencing agonist potency and selectivity for the opioid delta receptor are revealed in structure-activity relationship studies of the 4-[(N-substituted-4-piperidinyl)arylamino]-N,N-diethylbenzamides. J Med Chem 44:972-87 (2001)  
Target
Name:
Delta-type opioid receptor
Synonyms:
Cytochrome P450 3A4 Delta opioid receptor Delta-type opioid receptor (DOR) OPRD_RAT Opioid receptor Opioid receptors; mu & delta Ror-a | Voltage-gated potassium channel
Type:
G Protein-Coupled Receptor (GPCR)
Mol. Mass.:
40465.04
Organism:
Rattus norvegicus (rat)
Description:
Competition binding assays were using CHO-K1 cell membranes expressing the opioid receptor.
Residue:
372
  
Inhibitor
Name:
BDBM50098448
Synonyms:
4-[(1,3-Dimethyl-piperidin-4-yl)-(3-methoxy-phenyl)-amino]-N,N-diethyl-benzamide | 4-{[(3S)-1,3-dimethylpiperidin-4-yl](3-methoxyphenyl)amino}-N,N-diethylbenzamide
Type:
Small organic molecule
Emp. Form.:
C25H35N3O2
Mol. Mass.:
409.5643
SMILES:
CCN(CC)C(=O)c1ccc(cc1)N(C1CCN(C)C[C@@H]1C)c1cccc(OC)c1
: