Target
Cannabinoid receptor 2
Ligand
BDBM50180023
Substrate
Meas. Tech.
ChEMBL_329835 (CHEMBL854384)
Ki
>1000±n/a nM
Citation
 Stern, EMuccioli, GGMillet, RGoossens, JFFarce, AChavatte, PPoupaert, JHLambert, DMDepreux, PHénichart, JP Novel 4-oxo-1,4-dihydroquinoline-3-carboxamide derivatives as new CB2 cannabinoid receptors agonists: synthesis, pharmacological properties and molecular modeling. J Med Chem 49:70-9 (2006)  
Target
Name:
Cannabinoid receptor 2
Synonyms:
CANNABINOID CB2 CB2 CB2B CNR2_HUMAN Cannabinoid CB2 receptor Cannabinoid receptor 2 (CB2R) | hCB2
Type:
G Protein-Coupled Receptor (GPCR)
Mol. Mass.:
39690.94
Organism:
Homo sapiens (Human)
Description:
P34972
Residue:
360
  
Inhibitor
Name:
BDBM50180023
Synonyms:
CHEMBL199721 | N3-(3,4-dichlorophenyl)-4-oxo-1-pentyl-1,4-dihydroquinoline-3-carboxamide
Type:
Small organic molecule
Emp. Form.:
C21H20Cl2N2O2
Mol. Mass.:
403.302
SMILES:
CCCCCn1cc(C(=O)Nc2ccc(Cl)c(Cl)c2)c(=O)c2ccccc12
: