Target
Cytochrome P450 2E1
Ligand
BDBM50183058
Substrate
Meas. Tech.
ChEMBL_368940 (CHEMBL869056)
IC50
6000±n/a nM
Citation
 Vlahakis, JZKinobe, RTBowers, RJBrien, JFNakatsu, KSzarek, WA Imidazole-dioxolane compounds as isozyme-selective heme oxygenase inhibitors. J Med Chem 49:4437-41 (2006)  
Target
Name:
Cytochrome P450 2E1
Synonyms:
4-nitrophenol 2-hydroxylase CYPIIE1 Cyp2e-1 | Cyp2e1
Type:
Enzyme
Mol. Mass.:
56637.32
Organism:
Rattus norvegicus (rat)
Description:
CYP2E1 prepared from rat liver microsomes was used in enzyme assays.
Residue:
493
  
Inhibitor
Name:
BDBM50183058
Synonyms:
(2R,4S)-2-[2-(4-chlorophenyl)ethyl]-2-[(1H-imidazol-1-yl)-methyl]-4-methyl-1,3-dioxolane hydrochloride CHEMBL535613
Type:
Small organic molecule
Emp. Form.:
C16H19ClN2O2
Mol. Mass.:
306.787
SMILES:
C[C@H]1CO[C@@](CCc2ccc(Cl)cc2)(Cn2ccnc2)O1
: