Target
Mu-type opioid receptor
Ligand
BDBM50188879
Substrate
Meas. Tech.
ChEMBL_379381 (CHEMBL864838)
IC50
3030±n/a nM
Citation
 Alberati, DHainzl, DJolidon, SKurt, APinard, EThomas, AWZimmerli, D 4-Substituted-8-(1-phenyl-cyclohexyl)-2,8-diaza-spiro[4.5]decan-1-one as a novel class of highly selective GlyT1 inhibitors with superior pharmacological and pharmacokinetic parameters. Bioorg Med Chem Lett 16:4321-5 (2006)  
Target
Name:
Mu-type opioid receptor
Synonyms:
M-OR-1 MOR-1 MUOR1 Mu opiate receptor OPRM1 hMOP | mu-type opioid receptor isoform MOR-1
Type:
G Protein-Coupled Receptor (GPCR)
Mol. Mass.:
44789.51
Organism:
Homo sapiens (Human)
Description:
P35372
Residue:
400
  
Inhibitor
Name:
BDBM50188879
Synonyms:
CHEMBL214057 | rac-8-[1-(4-fluoro-phenyl)-cyclohexyl]-4-propyl-2,8-diaza-spiro[4.5]decan-1-one
Type:
Small organic molecule
Emp. Form.:
C23H33FN2O
Mol. Mass.:
372.5193
SMILES:
CCCC1CNC(=O)C11CCN(CC1)C1(CCCCC1)c1ccc(F)cc1
: