Target
Proto-oncogene tyrosine-protein kinase Src
Ligand
BDBM50198810
Substrate
Meas. Tech.
ChEMBL_437736 (CHEMBL905921)
IC50
21±n/a nM
Citation
 Noronha, GBarrett, KBoccia, ABrodhag, TCao, JChow, CPDneprovskaia, EDoukas, JFine, RGong, XGritzen, CGu, HHanna, EHood, JDHu, SKang, XKey, JKlebansky, BKousba, ALi, GLohse, DMak, CCMcPherson, APalanki, MSPathak, VPRenick, JShi, FSoll, RSplittgerber, UStoughton, STang, SYee, SZeng, BZhao, NZhu, H Discovery of [7-(2,6-dichlorophenyl)-5-methylbenzo [1,2,4]triazin-3-yl]-[4-(2-pyrrolidin-1-ylethoxy)phenyl]amine--a potent, orally active Src kinase inhibitor with anti-tumor activity in preclinical assays. Bioorg Med Chem Lett 17:602-8 (2007)  
Target
Name:
Proto-oncogene tyrosine-protein kinase Src
Synonyms:
Calmodulin/Proto-oncogene tyrosine-protein kinase Src Proto-oncogene c-Src SRC SRC_HUMAN V-src sarcoma (Schmidt-Ruppin A-2) viral oncogene homolog (avian) p60-Src | pp60c-src
Type:
Protein
Mol. Mass.:
59838.60
Organism:
Homo sapiens (Human)
Description:
P12931
Residue:
536
  
Inhibitor
Name:
BDBM50198810
Synonyms:
7-(2,6-dimethylphenyl)-5-methyl-N-(4-(2-(4-methylpiperazin-1-yl)ethoxy)phenyl)benzo[e][1,2,4]triazin-3-amine US8481536, 368 | US8481536, 576
Type:
Small organic molecule
Emp. Form.:
C29H34N6O
Mol. Mass.:
482.6199
SMILES:
CN1CCN(CCOc2ccc(Nc3nnc4cc(cc(C)c4n3)-c3c(C)cccc3C)cc2)CC1
: