Target
IAG-nucleoside hydrolase
Ligand
BDBM50371002
Substrate
Meas. Tech.
ChEMBL_438446 (CHEMBL886424)
Ki
87000±n/a nM
Citation
 Goeminne, AMcNaughton, MBal, GSurpateanu, GVan der Veken, PDe Prol, SVersées, WSteyaert, JApers, SHaemers, AAugustyns, K 1,2,3-Triazolylalkylribitol derivatives as nucleoside hydrolase inhibitors. Bioorg Med Chem Lett 17:2523-6 (2007)  
Target
Name:
IAG-nucleoside hydrolase
Synonyms:
Type:
PROTEIN
Mol. Mass.:
36316.77
Organism:
Trypanosoma vivax
Description:
ChEMBL_531315
Residue:
327
  
Inhibitor
Name:
BDBM50371002
Synonyms:
CHEMBL230061
Type:
Small organic molecule
Emp. Form.:
C15H19N3O4
Mol. Mass.:
305.3291
SMILES:
Cc1c(nnn1C[C@@H]1O[C@H](CO)[C@@H](O)[C@H]1O)-c1ccccc1
: