Target
Phosphatidylinositol 4,5-bisphosphate 3-kinase catalytic subunit alpha isoform
Ligand
BDBM25018
Substrate
Meas. Tech.
ChEMBL_438486 (CHEMBL887586)
IC50
2.5±n/a nM
Citation
 Hayakawa, MKaizawa, HMoritomo, HKoizumi, TOhishi, TYamano, MOkada, MOhta, MTsukamoto, SRaynaud, FIWorkman, PWaterfield, MDParker, P Synthesis and biological evaluation of pyrido[3',2':4,5]furo[3,2-d]pyrimidine derivatives as novel PI3 kinase p110alpha inhibitors. Bioorg Med Chem Lett 17:2438-42 (2007)  
Target
Name:
Phosphatidylinositol 4,5-bisphosphate 3-kinase catalytic subunit alpha isoform
Synonyms:
P42336 PI3-kinase subunit p110-alpha PIK3CA Phosphatidylinositol 3-kinase alpha (PI3Kalpha) Phosphatidylinositol 4,5-bisphosphate 3-kinase (PI3K) Phosphatidylinositol 4,5-bisphosphate 3-kinase catalytic subunit alpha (PI3Kalpha) Phosphatidylinositol 4,5-bisphosphate 3-kinase catalytic subunit alpha isoform (PI3-Ka) Phosphatidylinositol 4,5-bisphosphate 3-kinase catalytic subunit alpha isoform (PI3K p110alpha) Phosphatidylinositol 4,5-bisphosphate 3-kinase catalytic subunit alpha isoform (PI3K-alpha) Phosphatidylinositol 4,5-bisphosphate 3-kinase catalytic subunit alpha isoform (PI3Kalpha p110alpha) Phosphatidylinositol 4,5-bisphosphate 3-kinase catalytic subunit alpha isoform (PIK3CA) Phosphatidylinositol-4,5-bisphosphate 3-kinase catalytic subunit alpha isoform Phosphoinositide 3-Kinase (PI3K), alpha Chain A Phosphoinositide 3-kinases (PI3K) PtdIns-3-kinase p110 | p110 alpha
Type:
Enzyme Subunit
Mol. Mass.:
124294.87
Organism:
Homo sapiens (Human)
Description:
P42336
Residue:
1068
  
Inhibitor
Name:
BDBM25018
Synonyms:
3-(4-morpholin-4-ylthieno[3,2-d]pyrimidin-2-yl)phenol CHEMBL541643 thienopyrimidine derivative, 1
Type:
Small organic molecule
Emp. Form.:
C16H15N3O2S
Mol. Mass.:
313.374
SMILES:
Oc1cccc(c1)-c1nc(N2CCOCC2)c2sccc2n1
: