Target
Vascular endothelial growth factor receptor 2
Ligand
BDBM25018
Substrate
Meas. Tech.
ChEMBL_438491 (CHEMBL887591)
IC50
91000±n/a nM
Citation
 Hayakawa, MKaizawa, HMoritomo, HKoizumi, TOhishi, TYamano, MOkada, MOhta, MTsukamoto, SRaynaud, FIWorkman, PWaterfield, MDParker, P Synthesis and biological evaluation of pyrido[3',2':4,5]furo[3,2-d]pyrimidine derivatives as novel PI3 kinase p110alpha inhibitors. Bioorg Med Chem Lett 17:2438-42 (2007)  
Target
Name:
Vascular endothelial growth factor receptor 2
Synonyms:
CD_antigen=CD309 Fetal liver kinase 1 (FLK-1) KDR Protein-tyrosine kinase receptor Flk-1 VEGFR-2 VEGFR2 Vascular Endothelial Growth Factor Receptor Kinase 2 Vascular endothelial growth factor receptor 2 (KDR) Vascular endothelial growth factor receptor 2 (VEGFR2) Vascular endothelial growth factor receptor-2 (VEGFR-2)
Type:
Receptor Tyrosine Kinase
Mol. Mass.:
151510.97
Organism:
Homo sapiens (Human)
Description:
P35968
Residue:
1356
  
Inhibitor
Name:
BDBM25018
Synonyms:
3-(4-morpholin-4-ylthieno[3,2-d]pyrimidin-2-yl)phenol CHEMBL541643 thienopyrimidine derivative, 1
Type:
Small organic molecule
Emp. Form.:
C16H15N3O2S
Mol. Mass.:
313.374
SMILES:
Oc1cccc(c1)-c1nc(N2CCOCC2)c2sccc2n1
: