Target
Low molecular weight phosphotyrosine protein phosphatase
Ligand
BDBM50214527
Substrate
Meas. Tech.
ChEMBL_448046 (CHEMBL898301)
IC50
2500±n/a nM
Citation
 Maccari, RPaoli, POttanà, RJacomelli, MCiurleo, RManao, GSteindl, TLanger, TVigorita, MGCamici, G 5-Arylidene-2,4-thiazolidinediones as inhibitors of protein tyrosine phosphatases. Bioorg Med Chem 15:5137-49 (2007)  
Target
Name:
Low molecular weight phosphotyrosine protein phosphatase
Synonyms:
3.1.3.2 ACP1 LMW-PTP LMWPTP PPAC_HUMAN low molecular weight phosphotyrosine protein phosphatase isoform c
Type:
Mol. Mass.:
18042.81
Organism:
Homo sapiens (Human)
Description:
P24666
Residue:
158
  
Inhibitor
Name:
BDBM50214527
Synonyms:
4-((5-(4-(benzyloxy)benzylidene)-2,4-dioxothiazolidin-3-yl)methyl)benzoic acid CHEMBL235595
Type:
Small organic molecule
Emp. Form.:
C25H19NO5S
Mol. Mass.:
445.487
SMILES:
OC(=O)c1ccc(CN2C(=O)S\C(=C/c3ccc(OCc4ccccc4)cc3)C2=O)cc1
: