Target
Indoleamine 2,3-dioxygenase 1
Ligand
BDBM43339
Substrate
Meas. Tech.
ChEMBL_595171 (CHEMBL1040013)
IC50
6000±n/a nM
Citation
 Röhrig, UFAwad, LGrosdidier, ALarrieu, PStroobant, VColau, DCerundolo, VSimpson, AJVogel, PVan den Eynde, BJZoete, VMichielin, O Rational design of indoleamine 2,3-dioxygenase inhibitors. J Med Chem 53:1172-89 (2010)  
Target
Name:
Indoleamine 2,3-dioxygenase 1
Synonyms:
I23O1_HUMAN IDO-1 INDO Indoleamine 2,3-dioxygenase | Indoleamine-pyrrole 2,3-dioxygenase
Type:
Enzyme
Mol. Mass.:
45330.80
Organism:
Homo sapiens (Human)
Description:
P14902
Residue:
403
  
Inhibitor
Name:
BDBM43339
Synonyms:
4-amino-1-naphthalenol;hydrochloride 4-aminonaphthalen-1-ol;hydrochloride CHEMBL576321 PCMD-CC-PAB-253 | cid_2723858
Type:
Small organic molecule
Emp. Form.:
C10H9NO
Mol. Mass.:
159.1846
SMILES:
Nc1ccc(O)c2ccccc12
: