Target
Indoleamine 2,3-dioxygenase 1
Ligand
BDBM50241727
Substrate
Meas. Tech.
ChEMBL_595172 (CHEMBL1040014)
Ki
19000±n/a nM
Citation
 Röhrig, UFAwad, LGrosdidier, ALarrieu, PStroobant, VColau, DCerundolo, VSimpson, AJVogel, PVan den Eynde, BJZoete, VMichielin, O Rational design of indoleamine 2,3-dioxygenase inhibitors. J Med Chem 53:1172-89 (2010)  
Target
Name:
Indoleamine 2,3-dioxygenase 1
Synonyms:
I23O1_HUMAN IDO-1 INDO Indoleamine 2,3-dioxygenase | Indoleamine-pyrrole 2,3-dioxygenase
Type:
Enzyme
Mol. Mass.:
45330.80
Organism:
Homo sapiens (Human)
Description:
P14902
Residue:
403
  
Inhibitor
Name:
BDBM50241727
Synonyms:
(S)-2-amino-3-(1-methyl-1H-indol-3-yl)propanoic acid 1-methyltryptophan L-1-methyl-tryptophan
Type:
Small organic molecule
Emp. Form.:
C12H14N2O2
Mol. Mass.:
218.2518
SMILES:
Cn1cc(C[C@H](N)C(O)=O)c2ccccc12
: